Započeo Marchelo
•9. Jun 2016.• Zaključano[POMOC]Error stats
384
pregleda
2
postova
Wheel Man
Balkan SA:MP
SA-MP Doprinos
Balkan SA:MP
SA-MP DoprinosNovi Član
40 / 100 XP
Početnik(0)
28
Postovi:
11
Teme:
Pridružio se:Maj 2012
9. Jun 2016.
Moj Gamemode od 0
Bio sam dodavao stats sistem sa textdrawowima i izbacuje mi ove errore
ERORI OD 206-214
Error 2407
Bio sam dodavao stats sistem sa textdrawowima i izbacuje mi ove errore
C:\Users\user\Desktop\SAMP SERVER TESTING I OSTALO\SAMP\gamemodes\fafo.pwn(206) : error 017: undefined symbol "playerid"
C:\Users\user\Desktop\SAMP SERVER TESTING I OSTALO\SAMP\gamemodes\fafo.pwn(207) : error 017: undefined symbol "playerid"
C:\Users\user\Desktop\SAMP SERVER TESTING I OSTALO\SAMP\gamemodes\fafo.pwn(208) : error 017: undefined symbol "playerid"
C:\Users\user\Desktop\SAMP SERVER TESTING I OSTALO\SAMP\gamemodes\fafo.pwn(209) : error 017: undefined symbol "playerid"
C:\Users\user\Desktop\SAMP SERVER TESTING I OSTALO\SAMP\gamemodes\fafo.pwn(210) : error 017: undefined symbol "playerid"
C:\Users\user\Desktop\SAMP SERVER TESTING I OSTALO\SAMP\gamemodes\fafo.pwn(211) : error 017: undefined symbol "playerid"
C:\Users\user\Desktop\SAMP SERVER TESTING I OSTALO\SAMP\gamemodes\fafo.pwn(212) : error 017: undefined symbol "playerid"
C:\Users\user\Desktop\SAMP SERVER TESTING I OSTALO\SAMP\gamemodes\fafo.pwn(213) : error 017: undefined symbol "playerid"
C:\Users\user\Desktop\SAMP SERVER TESTING I OSTALO\SAMP\gamemodes\fafo.pwn(214) : error 017: undefined symbol "playerid"
C:\Users\user\Desktop\SAMP SERVER TESTING I OSTALO\SAMP\gamemodes\fafo.pwn(2407) : error 001: expected token: ")", but found "-integer value-"
C:\Users\user\Desktop\SAMP SERVER TESTING I OSTALO\SAMP\gamemodes\fafo.pwn(2407) : error 001: expected token: ";", but found ")"
C:\Users\user\Desktop\SAMP SERVER TESTING I OSTALO\SAMP\gamemodes\fafo.pwn(2407) : error 029: invalid expression, assumed zeroERORI OD 206-214
StatsText = TextDrawCreate(260.000000, 150.000000,"Racun");//1
TextDrawAlignment(StatsText,0);
TextDrawBackgroundColor(StatsText,255);
TextDrawFont(StatsText,1);
TextDrawLetterSize(StatsText,0.259999,0.600000);
TextDrawColor(StatsText,-1);
TextDrawSetOutline(StatsText,1);
TextDrawSetProportional(StatsText,1);
TextDrawSetShadow(StatsText,1);
Error 2407
if (PRESSED(KEY_SECONDARY_ATTACK))OG Legend
Balkan SA:MP
SA-MP Doprinos
Balkan SA:MP
SA-MP DoprinosNovi Član
246 / 250 XP
Početnik(0)
2,678
Postovi:
133
Teme:
Pridružio se:Maj 2012
9. Jun 2016.

Molimo te da procitas pravila foruma te da onda otvoris temu po pravilima.
Razlog zakljucavanja:
Nemas formular!
Pravila:
Glavna pravila Balkan SA:MP foruma .
Razgovor u vezi PAWN-Skriptanja .
Morate biti prijavljeni da biste odgovorili na ovu temu.
Prijava